Regiao Autonoma dos Acores
type: Class
alternative label: PT+20
subclass of: RA4Ca832861b2FADe1603e78
hidden label: PT+20
definition: Regiao Autonoma dos Acores is an autonomous region of Portugal consisting of a group of islands in the Atlantic Ocean.