Research and Innovative Technology Administration
type: Class
alternative label: 研究和创新技术管理局
subclass of: RC2Ddc09177c7B1338a16e36
hidden label: RITA
definition: The Research and Innovative Technology Administration (RITA) is a unit of the United States Department of Transportation (USDOT).