Office of the Solicitor General
type: Class
alternative label: 总检察长办公室
subclass of: R0DB70442Cf8b73D9275F14a
hidden label: OSG
definition: The task of the Office of the Solicitor General is to supervise and conduct government litigation in the United States Supreme Court. Virtually all such litigation is channeled through the Office of the Solicitor General and is actively conducted by the Office.