Personal Jurisdiction by Appearance
type: Class
alternative label: 出庭个人管辖权
subclass of: R7X4vuBVsbGf69DAu7Xotdw
definition: The concept of "Personal Jurisdiction by Appearance" refers to the authority of a court to hear a case against a defendant who has voluntarily appeared before the court, even if they do not have a physical presence in the court's jurisdiction.