DUPLICATE Motion to Use Cash Collateral
type: Class
subclass of: R8H8cpx25KBk3kH55YwSdDv
definition: A "Duplicate Motion to Use Cash Collateral" refers to a request made by a party in a bankruptcy case to use cash collateral that has already been requested by another party, and is no longer valid due to being a duplicate.