Oregon Circuit Court - Jackson County
type: Class
subclass of: RmGrykg1NdiaxO77n1a1lc
definition: Oregon Circuit Court - Jackson County: A court of general jurisdiction in Oregon that hears civil and criminal cases within Jackson County.