Marriage Dissolution Event
type: Class
preferred label: Civil Union Dissolution
alternative label: 婚姻解除事件
subclass of: RPxLPeiWGvmkHvdX9issjM
definition: From the state-court filing standard (NODS) dataset.