Washington Superior Court - Okanogan County
type: Class
subclass of: RChEjOHUONk1Yp2qm3OHJdc
definition: Washington Superior Court - Okanogan County refers to a specific court within the Washington Superior Court system that has jurisdiction over legal matters within Okanogan County.