Official Committee of Unsecured Creditors
type: Class
alternative label: 无抵押债权人官方委员会
subclass of: RCoOnTANPIS6LCYx2SVkLJL
definition: A creditors' committee serves to represent the interests of unsecured creditors in bankruptcy court proceedings and also in negotiations between the debtor and other groups. The entity defined by U.S. Bankruptcy Code in Section 1102(a)(1) to represent unsecured creditors.