Udmurtskaya Respublika
type: Class
alternative label: RU+UD
subclass of: R53E5e3A8871d86E4f7D1166
hidden label: RU+UD
definition: Udmurtskaya Respublika is a region within the Russian Federation with the official name of the Udmurt Republic.