New Zealand dollar
type: Class
alternative label: न्यूज़ीलैंड डॉलर
subclass of: R767niCLQVC5zIcO5WDQMSl
hidden label: NZD
definition: Locations used: New Zealand, Cook Islands(CK), Niue(NU), Pitcairn Islands(PN; see alsoPitcairn Islands dollar), Tokelau(TK)