Massachusetts State Courts
type: Class
alternative label: MA
subclass of: R1F4dbe4CD17b3B2a7f15b97
hidden label: MA
definition: The Massachusetts State Courts refer to the judicial system of Massachusetts, including the Massachusetts District Court, Massachusetts Appeals Court, Massachusetts Supreme Judicial Court, Massachusetts Trial Court, and Massachusetts Department of Industrial Accidents.