Defense Contract Management Agency
type: Class
alternative label: 国防合同管理局
subclass of: RF52f1c417a596A01b36Bcf0
hidden label: DCMA
definition: The Defense Contract Management Agency (DCMA) is an agency of the United States federal government reporting to the Under Secretary of Defense for Acquisition and Sustainment.