Kentucky State Courts
type: Class
alternative label: KY
subclass of: R1F4dbe4CD17b3B2a7f15b97
hidden label: KY
definition: The Kentucky State Courts refer to the judicial system of the state of Kentucky, including the Kentucky Court of Appeals and the Kentucky Supreme Court.