Khanty-Mansiyskiy avtonomnyy okrug
type: Class
alternative label: RU+KHM
subclass of: R53E5e3A8871d86E4f7D1166
hidden label: RU+KHM
definition: A region in Russia known as Khanty-Mansiyskiy avtonomnyy okrug, which is a self-governing administrative division within the country.