Proceeding Closed / Disposed and Set for Review
type: Class
alternative label: Case Closed / Disposed and Set for Review
subclass of: R7QqT8OYSjPMxWY3Tj1Nlam
definition: The concept of "Case Closed / Disposed and Set for Review" refers to a legal matter that has been concluded and is awaiting further examination or consideration.