Wilayah Persekutuan Kuala Lumpur
type: Class
alternative label: MY+14
subclass of: RAF7c6aA0D26e3DF9984F231
hidden label: MY+14
definition: Wilayah Persekutuan Kuala Lumpur refers to the federal territory of Kuala Lumpur in Malaysia.