U.S. Dept. of Interior
type: Class
preferred label: Department of the Interior
alternative label: 美国内政部
subclass of: R22815eC3Af3bFF0d002Ca58
hidden label: DOI
definition: The United States Department of the Interior (DOI) is the United States federal executive department of the U.S. government responsible for the management and conservation of most federal lands and natural resources, and the administration of programs relating to Native Americans, Alaska Natives, Native Hawaiians, territorial affairs, and insular areas of the United States.