Laamu
type: Class
alternative label: MV+05
subclass of: R45D3d83F1c4603C9903Af83
hidden label: MV+05
definition: Laamu is a geographic location in the Maldives, which is a country in South Asia consisting of a chain of islands in the Indian Ocean.