Tristan da Cunha
type: Class
alternative label: subdivision of Saint Helena, Ascension and Tristan da Cunha
alternative label: SH+TA
subclass of: R770ea065Ae652ADb0282f2b
hidden label: SH+TA
definition: Tristan da Cunha is a subdivision of Saint Helena, Ascension and Tristan da Cunha, consisting of a group of islands in the South Atlantic Ocean.