Braj
type: Class
alternative label: 布拉杰
subclass of: RDOvAHsvY8TKJ1O1orXPM9o
definition: Braj is a language that belongs to the Language top-level class and is commonly used in certain regions of India.