No-Fault Claim
type: Class
alternative label: 无过失索赔
subclass of: R9q0hyYnNxQC475BKXOxjbm
definition: A no-fault claim is a type of insurance claim where the policyholder is not required to prove fault or negligence in order to receive compensation for damages or injuries.
in scheme: India
country: Strict Liability Claim