Other Nonmetallic Mineral Mining and Quarrying
type: Class
subclass of: QIzHBkOqTPKH967TaRYAsA
definition: This industry comprises establishments primarily engaged in developing the mine site, mining, and/or milling or otherwise beneficiating (i.e., preparing) nonmetallic minerals (except coal, stone, sand, gravel, clay, and ceramic and refractory minerals). Drylake brine operations are included in this industry, as well as establishments engaged in producing the specified minerals from underground and open pit mines.
example: Barite mining and/or beneficiating
example: Borate, natural, mining and/or beneficiating
example: Peat mining and/or beneficiating
example: Phosphate rock mining and/or beneficiating
example: Potash mining and/or beneficiating
example: Rock salt mining and/or beneficiating