Judicial Immunity
type: Class
alternative label: 司法豁免权
subclass of: RBvhPeoPwTNYsc19VBpYjSV
definition: Judicial Immunity refers to the legal protection granted to judges from being held personally liable for actions taken in their official capacity, even if those actions are later found to be incorrect or unlawful.