WC280 Alternative Fee Arrangements
type: Class
subclass of: RmuBr7P8oT5amqF5m8FabIQ
definition: This code includes all non-hourly or other alternative fee arrangements for tasks and activities in this phase.