Regulatory Statement
type: Class
alternative label: 监管声明
subclass of: RBQwuwI8kIy4gvRmoiZHA5m
definition: A Regulatory Statement is a type of Invoice Data that contains information related to legal regulations and requirements.