Indigenous
type: Class
alternative label: 土著的
subclass of: RC50Vs3pkDyvqMHRukXE98O
definition: Indigenous refers to the ethnicity and race of people who are the original inhabitants of a particular region or territory, having unique cultural, historical, and social characteristics distinct from those of the dominant societies that may have colonized or settled in the area later.