Italian
type: Class
alternative label: 意大利语
subclass of: RDOvAHsvY8TKJ1O1orXPM9o
definition: Italian (Language) is a structured system of communication consisting of grammar and vocabulary used in Italy and other parts of the world, and is a subcategory of the Language class.