Advisory Committee on Construction Safety and Health
type: Class
alternative label: 建筑安全与健康咨询委员会
subclass of: R5DE425E15b8c8CE8fb6Eecf
hidden label: ACCSH
definition: ACCSH is a continuing advisory body established by statute that provides advice and assistance in construction standards and policy matters to the Department of Labor Assistant Secretary.