Child Dependency Claims
type: Class
alternative label: 依赖权利要求
subclass of: R8jYAnNATrfoBxAtIKpf72X
subclass of: RCUXzL8Z4Ddh2CK6TBhofjU
definition: Child Dependency Claims are legal claims related to child abuse, child neglect, and termination of parental rights, which fall under the broader categories of Civil Claims and Family Law and Matrimonial Claims.