Client Portal Management
type: Class
subclass of: ROb7P1zmS9dqMfXoFzhfu6
definition: The management of a web-based platform that allows clients to access and interact with legal services and information provided by a law firm.