U.S. Central Command
type: Class
alternative label: 美国中央司令部
subclass of: RF52f1c417a596A01b36Bcf0
hidden label: CENTCOM
definition: The United States Central Command (USCENTCOM or CENTCOM) is a theater-level Unified Combatant Command of the U.S. Department of Defense.