California State Courts
type: Class
alternative label: CA
subclass of: R1F4dbe4CD17b3B2a7f15b97
hidden label: CA
definition: California State Courts are the judicial branch of the California government responsible for interpreting and applying the law in civil and criminal cases within the state.