Bong
type: Class
alternative label: LR+BG
subclass of: RDD6d1375E1ffD977d6C81c9
hidden label: LR+BG
definition: A bong is a device used for smoking marijuana or other substances, typically consisting of a water-filled chamber and a tube through which the smoke is drawn.