Australian dollar
type: Class
alternative label: ऑस्ट्रेलियाई डॉलर
subclass of: R767niCLQVC5zIcO5WDQMSl
hidden label: AUD
definition: Locations used: Australia, Christmas Island(CX), Cocos (Keeling) Islands(CC), Heard Island and McDonald Islands(HM), Kiribati(KI), Nauru(NR), Norfolk Island(NF), Tuvalu(TV)