Shamal ash Sharqiyah
type: Class
alternative label: OM+SS
subclass of: R1CF0b9356d38393d26FDaa0
hidden label: OM+SS
definition: Shamal ash Sharqiyah refers to a region in Oman, located in the northeastern part of the country.