Niger (Subdivision of Nigeria)
type: Class
preferred label: Niger
alternative label: Subdivision of Nigeria
alternative label: NG+NI
subclass of: R4B9dec71E2dd97181f99777
hidden label: NG+NI
definition: Niger (Subdivision of Nigeria) is a region within Nigeria, with the name "Niger", also known as "Subdivision of Nigeria", and identified by the hidden labels "NG+NI".