Chari-Baguirmi
type: Class
alternative label: TD+CB
subclass of: R6EDec6FF87ec502564FAddf
hidden label: TD+CB
definition: Chari-Baguirmi refers to a region in Chad, located in the southern part of the country.