Northern Ireland
type: Class
alternative label: GB+NIR
subclass of: R63Ca8334A31353F4c03C206
hidden label: GB+NIR
definition: Northern Ireland refers to a region in the United Kingdom of Great Britain and Northern Ireland, located on the island of Ireland.