Kepulauan Bangka Belitung
type: Class
alternative label: ID+BB
subclass of: R4D912d7BF1522F346a04278
hidden label: ID+BB
definition: Kepulauan Bangka Belitung refers to a group of islands located in Indonesia.