Aviation Negligence Claim
type: Class
alternative label: 航空过失索赔
subclass of: RCfunX4u69LUQ3gbhckE0oI
subclass of: RKIJK5k2JFkQw4UvNU2YKl
definition: An aviation negligence claim is a legal action brought by a plaintiff against a defendant for damages resulting from injuries or harm caused by the defendant's negligent actions or omissions in the context of aviation.