Estimated Engagement Variables
type: Class
alternative label: 估计参与变量
subclass of: RX4QtTsK3lPhoabmq1bzBe
definition: Estimated Engagement Variables are specific terms used to define the estimated costs and resources required for a legal engagement, including but not limited to time, expenses, and personnel.