Sranan Tongo
type: Class
alternative label: 斯拉南东戈语
subclass of: RDOvAHsvY8TKJ1O1orXPM9o
definition: Sranan Tongo is a creole language spoken in Suriname that combines English, Dutch, and African languages.