Defense Commissary Agency
type: Class
alternative label: 国防委员会
subclass of: RF52f1c417a596A01b36Bcf0
hidden label: DeCA
definition: The Defense Commissary Agency (DeCA), headquartered at Fort Lee (Virginia), is an agency of the United States Department of Defense (DoD) that operates nearly 240 commissaries worldwide.