Office of Energy Efficiency and Renewable Energy
type: Class
alternative label: 能源效率与可再生能源办公室
subclass of: R03B8e7801139A7Fc60685a9
hidden label: EERE
definition: The Office of Energy Efficiency and Renewable Energy (EERE) is an office within the United States Department of Energy. Its mission is to help support the development of clean, renewable and efficient energy technologies to America and support a global clean energy economy.