Entry-Level Separation
type: Class
subclass of: Rp6HMd8Eea47JMlXfYvttU
definition: Entry-Level Separation is given to individuals who are separated from the military before completing their initial training or within a short time of their service commencement. It's a neutral discharge, meaning it is neither favorable nor unfavorable, and typically reflects that the individual was not suited for military service.