Bamileke languages
type: Class
alternative label: 巴米列克语
subclass of: RDOvAHsvY8TKJ1O1orXPM9o
definition: The Bamileke languages are a group of related languages spoken in Cameroon and characterized by their unique grammatical structures and vocabulary.