Indiana Town Court - Hendricks County, Plainfield Town
type: Class
subclass of: RBB5cexM3974afJhhR2yXHA
definition: A court located in Plainfield Town, Hendricks County, Indiana that has jurisdiction over local ordinance violations and minor criminal offenses.