Fault Divorce
type: Class
alternative label: 过失离婚
subclass of: RDhTbfA9WACnFGtRuw8v57e
definition: A fault divorce is a legal process of ending a marriage where one spouse is found to be at fault for the breakdown of the marriage, such as through adultery, cruelty, or abandonment.