Missouri Circuit Court - Saline County
type: Class
subclass of: RDECjssxw76vdlahxiUTb4L
definition: A Missouri Circuit Court in Saline County is a specific court within the Missouri Circuit Court system that has jurisdiction over legal proceedings in Saline County, Missouri.